MDS-Onto
type: Ontology
creator: SDLE Research Center
description: MDS-Onto combines concepts from all different the different ontologies in Materials Data Science
license: https://creativecommons.org/licenses/by-sa/4.0/
version info: 0.3.0.0

has broader
type: ObjectProperty
comment: Broader concepts are typically rendered as parents in a concept hierarchy (tree).
definition: Relates a concept to a concept that is more general in meaning.

Person
type: Class

AFMChannel
type: Class
subclass of: Tool
definition: Speed of spin-coating.

AFMInstrument
type: Class
subclass of: Tool
type: NamedIndividual
broader: Tool
definition: An instrument that does atomic force microscopy (AFM)
definition: Piezoelectric sensor location of the AFM instrument.

AFMInstrumentModel
type: Class
type: NamedIndividual
broader: Tool
definition: Model of the AFM instrument

AFMTip
type: Class
type: NamedIndividual
broader: Tool
definition: A tip used in an AFM instrument that scans across a sample

Absorbance
type: Class
subclass of: Result
definition: absorbance read by instrument

Accessory
type: Class
subclass of: Tool
definition: Accessory used for the measurement
definition: An additional component or device such as crystal, gas cell, or sample holder, that enhances or modifies the functionality of the instrument.

Ad2
type: Class
subclass of: ValueObject
type: NamedIndividual
broader: Result

AmbientTemperature
type: Class
subclass of: PhotovoltaicSiteParameter
label: AmbientTemperature

Amplitude
type: Class
subclass of: Recipe
definition: Drying temperature in the evaporation process of film preparation.

Analysis
type: Class
subclass of: NonTransformativeAnalysisProcess
type: NamedIndividual
broader: Model
definition: A process using statistical techniques to examine data to extract underlying relationships

BackgroundScans
type: Class
subclass of: Recipe
definition: measurement of the infrared radiation for baseline correction.

backsheet
type: Class
subclass of: Sample
definition: Material used to cover the rear of the module. E.g., TPT, Tedlar.

BeamSplitter
type: Class
subclass of: Tool
definition: Multiple beamsplitter options are present such as KBr, XT-KBr, and Quartz

Beamsplitter
type: Class
subclass of: Tool
definition: Multiple beamsplitter options are present such as KBr, XT-KBr, and Quartz

BoardType
type: Class
subclass of: Shape
type: NamedIndividual
broader: Sample
definition: Shape describing the interdigitated comb board

Cantilever
type: Class
subclass of: Tool

CantileverForceConstant
type: Class
type: NamedIndividual
broader: Recipe
definition: the force constant of the cantilever; depends on the material

CantileverMaterial
type: Class
type: NamedIndividual
broader: Tool
definition: the material of the AFM cantilever

CantileverResonanceFrequency
type: Class
type: NamedIndividual
broader: Recipe
definition: the resonance frequency of the cantilever; depends on the material

CaptureRateMax
type: Class
type: NamedIndividual
broader: Recipe

CaptureRateMin
type: Class
type: NamedIndividual
broader: Recipe

Category
type: Class
subclass of: ValueObject
type: NamedIndividual
broader: Model

Cell
type: Class

cell-area
type: Class
subclass of: Sample
definition: Total cell surface area.

CellCount
type: Class
subclass of: Sample
definition: Number of cells in a module

CellCutType
type: Class
subclass of: PhotovoltaicCellProperty
subclass of: ValueObject
type: NamedIndividual
broader: Sample
label: CellCutType

CellEfficiency
type: Class
subclass of: Result
definition: The cell efficiency measured by a current voltage process

CellReferenceConstant
type: Class
subclass of: Tool
definition: A calibration setting that deteremines the irradiance level of a light source, typically determined by a reference cell

cell-technology
type: Class
subclass of: Sample
definition: Technology used on the cell level, i.e., cell architecture. E.g., Al-BSF, PERC, PERT, MWT, IBC, SHJ.

CellTechnologyType
type: Class
subclass of: PhotovoltaicCellProperty
subclass of: ValueObject
type: NamedIndividual
broader: Sample
label: CellTechnologyType
definition: Cell technology (PERC, TOPCon, Al-BSF, CdTe, CIGS, etc)

cells-per-string
type: Class
subclass of: Sample
definition: The number of cells in series together per individual string. E.g., 60, 72, etc.

ChargeControllerType
type: Class
subclass of: PhotovoltaicChargeControllerProperty
label: ChargeControllerType
definition: Charge controller type.

Cleanliness
type: Class
subclass of: ValueObject
type: NamedIndividual
broader: Sample
definition: Value describing the cleanliness of the interdigitated comb

ClimateZone
type: Class
subclass of: PhotovoltaicSiteParameter
label: ClimateZone

connector-type
type: Class
subclass of: Sample
definition: Which version of lead connection is used to connect panel. E.g, MC4, MC3, T4.

Correction
type: Class
subclass of: Tool
definition: The process of adjusting the spectral data to account for any instrumental factor like baseline correction.

CurrentAtMaxPower
type: Class
subclass of: Result
definition: The current at max power measured by a current voltage process

CurrentAtMaximumPower
type: Class
subclass of: PhotovoltaicCellProperty
subclass of: Sample
label: CurrentAtMaximumPower
definition: DC current at maximum power point
definition: DC current at the maximum power point under STC

CurrentShortCircuit
type: Class
subclass of: PhotovoltaicCellProperty
subclass of: Sample
label: CurrentShortCircuit
definition: Module short circuit current
definition: Short-circuit current of the cell

CurrentVoltageAnalysis
type: Class
subclass of: Analysis
definition: The analysis method used on a raw dataset generated by a current voltage process

CurrentVoltageData
type: Class
subclass of: Result
definition: The raw current voltage data generated by a current voltage process

CurrentVoltageDataFilePath
type: Class
subclass of: FilePath
definition: The file path of a dataset generated by a current voltage process

CurrentVoltageRecipe
type: Class
subclass of: Recipe
type: NamedIndividual
broader: Recipe
definition: A recipe describing the settings for a current voltage process

CurrentVoltageRecipeAuthor
type: Class
subclass of: Recipe
definition: The author of a recipe for a current voltage process

CurrentVoltageRecipeCreatedDate
type: Class
subclass of: Recipe
definition: The creation date for a current voltage process recipe

CurrentVoltageRecipeFilePath
type: Class
subclass of: Recipe
definition: The file path for a current voltage process recipe

CurrentVoltageRecipeID
type: Class
subclass of: RecipeID
definition: The identification number for a current voltage recipe

CurrentVoltageResults
type: Class
subclass of: Result
definition: The parameters that resulted from the current voltage process

CurrentVoltageResultsTimestamp
type: Class
subclass of: Date
definition: The datetime when a current voltage process was executed

CurrentVoltageSample
type: Class
subclass of: Sample
definition: A sample used in a current voltage process

CurrentVoltageStepSize
type: Class
subclass of: Tool
definition: The step size of the voltage for a current voltage process

Date
type: Class
subclass of: Date
type: NamedIndividual
broader: Recipe

DateImaged
type: Class
subclass of: Date

Department
type: Class
subclass of: Department
type: NamedIndividual
broader: Tool

DetectionWavelength
type: Class
type: NamedIndividual
broader: Recipe

Detector
type: Class
subclass of: Tool
definition: A sensitive component that converts infrared radiation from the sample into an electrical signal for spectral analysis.
definition: Sofwtare used in the instrument

DetectorLength
type: Class
subclass of: Length
type: NamedIndividual
characteristic of: SyncXrayDetector
unit: MilliM
value: XMLSchemafloat
definition: Length of the detector.

DetectorName
type: Class
subclass of: Identifier
type: NamedIndividual
value: XMLSchemastring
definition: Name of the detector.

DetectorType
type: Class
type: NamedIndividual
broader: Tool

DetectorWidth
type: Class
subclass of: Width
type: NamedIndividual
characteristic of: SyncXrayDetector
unit: MilliM
value: XMLSchemafloat
definition: Width of the detector.

DimensionsImage
type: Class
subclass of: Result
definition: Type of solvent for thin-film preparation.

Dimple
type: Class
subclass of: FractographyImageCharacteristic
definition: Tipped structures resulting from ductile failure

Distance
type: Class
subclass of: Distance
type: NamedIndividual
broader: Recipe

DistanceFromSample
type: Class
subclass of: Distance
subclass of: ValueObject
type: NamedIndividual
broader: Recipe
unit: MilliM
value: XMLSchemafloat
definition: Distance of the detector from the sample.

DriveAmplitude
type: Class
subclass of: Recipe

Elevation
type: Class
subclass of: PhotovoltaicSiteParameter
label: Elevation
definition: Elevation above sea level

encapsulant
type: Class
subclass of: Sample
definition: Polymer material used to hold front sheet and back sheet together. Eg., EVA, POE, etc.

EncapsulantMaterial
type: Class
subclass of: Sample
definition: Material of the polymer encapsulant

Energy
type: Class
subclass of: Force
type: NamedIndividual
unit: KiloEV
value: XMLSchemafloat
definition: The energy of the incident beam.

EnergyUsed
type: Class
type: NamedIndividual
broader: Recipe

EstimatedStressIntensityFactor
type: Class
subclass of: FractographyImageCharacteristic
definition: An estimation of the stress amplification at the crack tip

ExposureConditions
type: Class
subclass of: Recipe
definition: The specific environmental factors and durations to which samples are subjected to before characterization.

ExposureStep
type: Class
subclass of: Result
definition: The step count of the exposure.

ExposureTemperatureSet
type: Class
subclass of: Recipe
definition: The temperature set point of the chamber.

ExposureTime
type: Class
type: NamedIndividual
broader: Recipe

ExposureType
type: Class
subclass of: Recipe
definition: The type of exposure e.g. damp heat, cyclic UV, outdoors.

Facility
type: Class
subclass of: Laboratory
type: NamedIndividual
value: XMLSchemastring
definition: Facility where the experiment was performed.

FacilityAmbientTemperature
type: Class
subclass of: Recipe
definition: The ambient temperature of the room that a current voltage process is being performed in

FieldOfView
type: Class
definition: the field of view of an AFM scan

FileExtension
type: Class
type: NamedIndividual
broader: Result

FilePath
type: Class
subclass of: ValueObject
type: NamedIndividual
broader: Result

FillFactor
type: Class
subclass of: Result
definition: The fill factor measured by a current voltage process

FilmDimentions
type: Class
subclass of: Recipe

FilmPreparation
type: Class
subclass of: Recipe

FilterType
type: Class
type: NamedIndividual
broader: Tool

FingerAmount
type: Class
subclass of: ValueObject
type: NamedIndividual
broader: Sample
definition: Value describing the number of fingers an interdigitated comb posseses

FlashWaitTime
type: Class
subclass of: Recipe
definition: The amount of time between flash pulses

FluorescencePattern
type: Class
subclass of: Sample
definition: A UVF fluorescence pattern of a module

FocalDistance
type: Class
type: NamedIndividual
broader: Tool

Force
type: Class
subclass of: Force
type: NamedIndividual
broader: Recipe

FractographyImage
type: Class
subclass of: Result

FractographyImageCharacteristic
type: Class
subclass of: Result

frame-material
type: Class
subclass of: Sample
definition: Material used for the module frame.

FrameRate
type: Class
type: NamedIndividual
broader: Recipe

GainParameters
type: Class
subclass of: Recipe
definition: Amplitude image from AFM instrument.

Gap
type: Class
subclass of: ValueObject
type: NamedIndividual
broader: Sample
definition: Value describing the space between each finger of an interdigitated comb

Geometry
type: Class
subclass of: ValueObject
type: NamedIndividual
broader: Sample

HatchDistance
type: Class
type: NamedIndividual
broader: Recipe

HotStage
type: Class
type: NamedIndividual
broader: Tool
definition: hot stage for temperature dependent AFM experiments

HotStageDiameter
type: Class
type: NamedIndividual
broader: Tool

HotStageTemperature
type: Class
subclass of: Recipe
type: NamedIndividual
broader: Tool
definition: temperature range of a hotstage in an AFM instrument

Identifier
type: Class
subclass of: Identifier

ImageSequence
type: Class
subclass of: SequenceNumber
type: NamedIndividual
value: Seq
definition: Running sequence of the image taken.

InitiationSite
type: Class
subclass of: FractographyImageCharacteristic

Instrument
type: Class
subclass of: Tool
definition: A NicoletFTIR-OpticalSpectroscopy for chemical analysis
definition: An AgilentFTIR-OpticalSpectroscopy for chemical analysis

InstrumentID
type: Class
type: NamedIndividual
broader: Tool

InstrumentName
type: Class
type: NamedIndividual
broader: Tool

IntegralGrain
type: Class
type: NamedIndividual
broader: Tool
definition: Phase image from AFM instrument.

Intensity
type: Class
subclass of: NodeInfo
type: NamedIndividual
broader: Recipe
broader: Tool

interconnection-scheme
type: Class
subclass of: Sample
definition: Method used to wire cells together. RIBBON, SHINGLED, WIRE

InterdigitatedComb
type: Class
subclass of: Sample
definition: Specimen subclass for an individual interdigitated comb

InterdigitatedCombIdentifier
type: Class
subclass of: SpecimenName
type: NamedIndividual
broader: Sample
definition: Identifier for each pattern of a board containing interdigitated combs

Irradiance
type: Class
subclass of: PhotovoltaicSiteParameter
label: Irradiance

junction-box-locations
type: Class
subclass of: Sample
definition: Location on rear of module housing junction box(es). Location could be on module EDGE; CENTER or SPLIT are commonly seen on half-cell modules.

Laboratory
type: Class
subclass of: Laboratory
type: NamedIndividual
broader: Tool

Latitude
type: Class
subclass of: PhotovoltaicSiteParameter
label: Latitude
definition: North/south position of a point on the Earth, decimal format

Length
type: Class
subclass of: Result
subclass of: Sample
subclass of: Length
type: NamedIndividual
broader: Recipe
definition: Length of the module along longest side
definition: Length of the sample

LightRange
type: Class
subclass of: Recipe
definition: Range of light levels that can be used

LoadPulseLength
type: Class
subclass of: Recipe
definition: The amount of time data is acquired during flash pulses

LoadVoltage
type: Class
subclass of: Tool
definition: The standard testing condition load voltage of a sample being measured

LogFile
type: Class
subclass of: Metadata
type: NamedIndividual
value: XMLSchemastring
definition: Contains log of the results.

Longitude
type: Class
subclass of: PhotovoltaicSiteParameter
label: Longitude
definition: East/west position of a point on the Earth, decimal format

Magnification
type: Class
type: NamedIndividual
broader: Recipe

make
type: Class
subclass of: Manufacturer
definition: Manufacturer or creator of device.

Manufacturer
type: Class
subclass of: Tool
subclass of: Manufacturer
type: NamedIndividual
broader: Tool
definition: A company or entity that designs, produces, and supplies the instrument and its accessories.
definition: Manufacturer of the instrument

Masking
type: Class
subclass of: ValueObject
type: NamedIndividual
broader: Sample
definition: Value describing the masking of an interdigitated comb

MaterialName
type: Class
subclass of: Sample
definition: The name of the sample

MaterialType
type: Class
subclass of: Sample
definition: The type of material used as sample

MaximumPowerPoint
type: Class
subclass of: Result
definition: The maximum power point measured by a current voltage process

Measurement
type: Class
subclass of: Result
definition: Chemical analysis carried out on the sample.

MeasuringDevice
type: Class
subclass of: MeasuringDevice
type: NamedIndividual
broader: Tool

Metadata
type: Class
subclass of: Metadata
type: NamedIndividual
broader: Result

MetadataFormat
type: Class
type: NamedIndividual
broader: Result

Model
type: Class
subclass of: Algorithm
type: NamedIndividual
definition: An algorithm that describes an underlying relationship between inputs and outputs

ModelFilePath
type: Class
subclass of: FilePath
type: NamedIndividual
broader: Model
value: XMLSchemastring
definition: File path unique to a model

ModelID
type: Class
subclass of: Identifier
type: NamedIndividual
broader: Model
value: XMLSchemastring
definition: Unique ID of a model

ModelName
type: Class
subclass of: Identifier
type: NamedIndividual
broader: Model
value: XMLSchemastring
definition: Human-readable, English name of a model

ModelResults
type: Class
subclass of: Result
type: NamedIndividual
broader: Model
value: XMLSchemastring
definition: Results of a model

ModelType
type: Class
subclass of: Category
type: NamedIndividual
broader: Model
value: XMLSchemastring
definition: Type of a model (linear, regression, logistic, etc.)

module-arc
type: Class
subclass of: Sample
definition: Front glass module anti-reflective coating. Boolean.

module-area
type: Class
subclass of: Sample
definition: Total area of module surface in cm2.

ModuleEfficiency
type: Class
subclass of: Sample
definition: Theoretical efficency of a module

ModuleEncapsulant
type: Class
subclass of: Sample
definition: Polymer encapsulant of a module

ModuleJunctionBox
type: Class
subclass of: Sample
definition: Electrical junction box for connection to the module

module-packaging
type: Class
subclass of: Sample
definition: The materials used for each layer of the solar panel excluding cell components. Either glass on glass (GG), glass with backsheet GB), glass with transparent backsheet (GTB).

ModuleRatingAtReference
type: Class
subclass of: Sample
definition: Measurements of a module taken at STC and 1000 W/m^2 irradiance

ModuleRatingCondition
type: Class
subclass of: PhotovoltaicCellProperty
subclass of: Sample
label: ModuleRatingCondition
definition: Condition of the cell
definition: Condition of the module

MountingType
type: Class
subclass of: Tool
label: MountingType
definition: How the arrays are mounted (fixed, one axis tracker, two axis tracker, vertical, etc)

nameplate-imp
type: Class
subclass of: Sample
definition: Current at maximum power point rated at STC.

nameplate-isc
type: Class
subclass of: Sample
definition: Short-circuit current rated at STC

nameplate-pmp
type: Class
subclass of: Sample
definition: Maximum power rated at STC.

nameplate-vmp
type: Class
subclass of: Sample
definition: Voltage at maximum power point rated at STC.

nameplate-voc
type: Class
subclass of: Sample
definition: Open-circuit voltage rated at STC

NodeSerialNumber
type: Class
subclass of: NodeSerialNumber
type: NamedIndividual
broader: Tool

NumScans
type: Class
subclass of: Recipe
definition: Number of scans for each run

number-busbars
type: Class
subclass of: Sample
definition: Number of busbars present per cell. Non-ribbon based technologies show none.

cells-x
type: Class
subclass of: Sample
definition: Number of cells in the shortest direction. E.g., 6, 8, 10

cells-y
type: Class
subclass of: Sample
definition: Number of cells in the longest direction. E.g., 10, 12, 20

NumberInverters
type: Class
subclass of: PhotovoltaicSiteParameter
label: NumberInverters
definition: Number of inverters located at the site

number-junction-box
type: Class
subclass of: Sample
definition: Total number of junction boxes present on the module.

NumberOfCellsPerString
type: Class
subclass of: Tool
definition: Number of cells in a group of solar panels connected in series in a module

number-parallel-strings
type: Class
subclass of: Sample
definition: Number of series connections present in the module. 1 if all cells in series, 2 or more otherwise.

NumberStrings
type: Class
subclass of: Tool
definition: Number of groups of solar panels connected in series in a module

NumberofScan
type: Class
subclass of: Recipe

Objective
type: Class
subclass of: Object
type: NamedIndividual
broader: Recipe
definition: Objective lens, ex: 5X, 20X

ObservedFailure
type: Class
subclass of: FractographyImageCharacteristic
definition: Perminant deformation caused by fracture

ObservedModeOneFailure
type: Class
subclass of: ObservedFailure
definition: Failure of a material by tensile stress normal to the plane of the crack, ie: opening

ObservedModeThreeFailure
type: Class
subclass of: ObservedFailure
definition: Failure of a material by shear stress parallel to the plane of the crack and parallel to the crack front, ie: tearing

ObservedModeTwoFailure
type: Class
subclass of: ObservedFailure
definition: Failure of a material by shear stress parallel to the plane of the crack and perpendicular ot the crack front, ie: sliding

OpenCircuitVoltage
type: Class
subclass of: Result
definition: The open circuit voltage measured by a current voltage process

OperatorName
type: Class

OrangeButtonTerm
type: Class
subclass of: ValueObject
definition: Term from the OrangeButton Taxonomy

OutputCurrent
type: Class
subclass of: PhotovoltaicChargeControllerProperty
label: OutputCurrent
definition: Charge controller output voltage [A-dc].

OutputVoltage
type: Class
subclass of: PhotovoltaicChargeControllerProperty
label: OutputVoltage
definition: Charge controller output voltage [V-dc].

Person
type: Class
subclass of: Person
type: NamedIndividual
broader: Recipe

PersonORCiD
type: Class
subclass of: Identifier
definition: Unique ID of a person

Phase
type: Class
definition: Drying time in the evaporation process of film preparation.

PhotovoltaicBacksheet
type: Class
subclass of: ProcessingNode
definition: Polymer backsheet of a PV cell or module

PhotovoltaicCell
type: Class
subclass of: ProvidedIdentifier
subclass of: Tool
label: PhotovoltaicCell
definition: PV cell that composes a module

PhotovoltaicCellID
type: Class
subclass of: SampleID
label: PhotovoltaicCellID
definition: Identifier for the PV cell

PhotovoltaicCellProperty
type: Class
subclass of: Sample
label: PhotovoltaicCellProperty
definition: A property of a PV cell

PhotovoltaicChargeController
type: Class
subclass of: Tool
label: PhotovoltaicChargeController

PhotovoltaicChargeControllerID
type: Class
subclass of: ToolID
label: PhotovoltaicChargeControllerID
definition: Charge controller id.

PhotovoltaicChargeControllerNote
type: Class
subclass of: Tool
label: PhotovoltaicChargeControllerNote

PhotovoltaicChargeControllerProperty
type: Class
subclass of: Tool
label: PhotovoltaicChargeControllerProperty

PhotovoltaicInverter
type: Class
subclass of: Tool
label: PhotovoltaicInverter
definition: An inverter to convert DC to AC

model
type: Class
subclass of: ProvidedIdentifier
type: NamedIndividual
broader: Sample
definition: Signifier of series or line of products.

PhotovoltaicModule
type: Class
subclass of: ProvidedIdentifier
subclass of: Tool
label: PhotovoltaicModule
definition: A PV module, comprised of cells, for field deployment

PhotovoltaicModuleID
type: Class
subclass of: SampleID
definition: Module identifier

PhotovoltaicModuleProperty
type: Class
subclass of: Sample
definition: A property of a PV module

PhotovoltaicRacking
type: Class
subclass of: PhotovoltaicSiteParameter
label: PhotovoltaicRacking
definition: How PV modules are arranged within the system

PhotovoltaicSite
type: Class
subclass of: Location
subclass of: Recipe
label: PhotovoltaicSite
definition: Physical location of a PV site

PhotovoltaicSiteID
type: Class
subclass of: Recipe
label: PhotovoltaicSiteID
definition: Site identifier

PhotovoltaicSiteNote
type: Class
subclass of: Recipe
label: PhotovoltaicSiteNote

PhotovoltaicSiteParameter
type: Class
subclass of: Recipe
label: PhotovoltaicSiteParameter
definition: Parameter or property a PV site has

PiezoelectricSensor
type: Class
type: NamedIndividual
broader: Tool

PiezoelectricSensorLocation
type: Class
type: NamedIndividual
broader: Tool
definition: Dimension of the fluoroelastomer film.

PixelSize
type: Class
subclass of: Length
type: NamedIndividual
characteristic of: SyncXrayDetector
unit: MicroM
value: XMLSchemafloat
definition: Pixel size of the detector.

PlaneOfArrayIrradiance
type: Class
subclass of: PhotovoltaicSiteParameter
label: PlaneOfArrayIrradiance

PlateNumber
type: Class
subclass of: NodeSerialNumber
type: NamedIndividual
broader: Tool
definition: A subcomponent of an occurent

Plating
type: Class
subclass of: ValueObject
type: NamedIndividual
broader: Sample
definition: Value describing the plating of an interdigitated comb

Position
type: Class
subclass of: ValueObject
type: NamedIndividual
broader: Result
definition: Position of ---

Power
type: Class
subclass of: ValueObject
type: NamedIndividual
broader: Recipe

PowerDC
type: Class
subclass of: PhotovoltaicCellProperty
subclass of: Sample
label: PowerDC
definition: DC power at STC, 1 sun of irradiance
definition: DC power produced by the cell

PowerSTC
type: Class
subclass of: Sample
definition: Power at refrence conditions

PreFiltration
type: Class
type: NamedIndividual
broader: Recipe

PrimaryData
type: Class
subclass of: PrimaryData
type: NamedIndividual
broader: Result

ProfilometryInsturment
type: Class
subclass of: ProcessingNode

ProfilometryInsturmentID
type: Class
subclass of: ToolID

ProfilometryModel
type: Class
subclass of: NodeModel
type: NamedIndividual
broader: Tool
definition: Model of the insturment being used

ProjectIdentifier
type: Class
subclass of: ProjectIdentifier
type: NamedIndividual
broader: Result

PyrometerInstrument
type: Class
subclass of: Tool

PyrometerReading
type: Class

PyrometryInstrument
type: Class
subclass of: Tool

PyrometryMonitor
type: Class
subclass of: Tool
definition: In situ monitor of print

RackingType
type: Class
subclass of: Tool
label: RackingType
definition: Type of racking used (open, closed, roof, etc)

ReadMode
type: Class
subclass of: Recipe
label: ReadingMode
definition: The specific method or setting used by the spectrometer to acquire spectral data from the sample.

ReadingSpeed
type: Class
subclass of: Recipe
label: readingTime
definition: Time the instrument takes for the readings

ReadingSpeed
type: Class
subclass of: Recipe
label: ReadingTime
definition: Time the instrument takes for the readings

Recipe
type: Class
subclass of: Method
type: NamedIndividual
definition: A set of specifications that describes how a process is carried out

RecipeAuthor
type: Class
subclass of: Person
type: NamedIndividual
broader: Recipe
value: XMLSchemastring
definition: Person created a recipe

RecipeCreatedDate
type: Class
subclass of: Date
type: NamedIndividual
broader: Recipe
value: XMLSchemadateTime
definition: Date that a recipe is created

RecipeFilePath
type: Class
subclass of: FilePath
type: NamedIndividual
broader: Recipe
value: XMLSchemastring
definition: File path unique to a recipe

RecipeID
type: Class
subclass of: Identifier
type: NamedIndividual
broader: Recipe
value: XMLSchemastring
definition: Unique ID for a recipe

RecipeModifiedDate
type: Class
subclass of: Date
type: NamedIndividual
broader: Recipe
value: XMLSchemadateTime
definition: Date that a recipe is modified

RelativeHumidity
type: Class
subclass of: Recipe
definition: Water content in the air divided by maximum water held at that temperature.

Resolution
type: Class
subclass of: Recipe
type: NamedIndividual
broader: Recipe
broader: Tool
definition: The ability of the spectrometer to distinguish between closely spaced spectral features i.e smallest difference in wavenumbers.

ResonanceFrequency
type: Class
type: NamedIndividual
broader: Tool
definition: Solvent concentration.

Result
type: Class
subclass of: PrimaryData
type: NamedIndividual
definition: A consequence, effect, or outcome of a process

ResultID
type: Class
subclass of: Identifier
type: NamedIndividual
broader: Result
value: XMLSchemastring
definition: Unique ID of a result

RiverPattern
type: Class
subclass of: FractographyImageCharacteristic
definition: The pattern which results from fatigue crack growth

RollRange
type: Class
subclass of: Recipe
definition: Range of roll motion

RunEndDate
type: Class
type: NamedIndividual
broader: Recipe

RunStartDate
type: Class
type: NamedIndividual
broader: Recipe

Sample
type: Class
subclass of: Sample
type: NamedIndividual

SampleCellArea
type: Class
subclass of: Sample
definition: Area of an invididual cell within a module that a current voltage process is being performed on

SampleDate
type: Class
subclass of: Date
type: NamedIndividual
broader: Sample
value: XMLSchemadateTime
definition: Date that a sample was created

SampleDimension
type: Class
subclass of: ValueObject
type: NamedIndividual
broader: Sample
value: XMLSchemafloat
definition: Dimensions of a sample (if sample is solid)

SampleID
type: Class
subclass of: Identifier
type: NamedIndividual
broader: Sample
value: XMLSchemastring
definition: Controls response time of the feedback loop; can dramatically affect the image quality and dependent on both the duration and magnitude of the error signal.
definition: Unique ID of a sample

SampleRate
type: Class
subclass of: ValueObject
type: NamedIndividual
broader: Recipe
definition: output sampling rate

SampleResistivity
type: Class
subclass of: Sample
definition: Resisitivity of the sample that a current voltage is being performed on

SampleScans
type: Class
subclass of: Recipe
definition: The process of collecting infrared spectral data from a sample by measuring the absorption at varoius wavelenghths.

SampleSize
type: Class
type: NamedIndividual
broader: Sample
definition: Size of samples that are within working range of an AFM instrument

SampleTotalArea
type: Class
subclass of: Sample
definition: Total area of the module that a current voltage process is being performed on

SaturationCurrentDensity
type: Class
subclass of: Result
definition: The saturation current density measured by a current voltage process

Scale
type: Class
type: NamedIndividual
broader: Recipe

ScanAngle
type: Class
type: NamedIndividual
broader: Recipe
definition: Angle at which the scanning occurs.

ScanLines
type: Class
type: NamedIndividual
broader: Recipe

ScanParameters
type: Class
type: NamedIndividual
broader: Recipe
definition: Size of the AFM scan along one side of the square.

ScanRate
type: Class
type: NamedIndividual
broader: Recipe
definition: Controls the rate at which the cantilever scans the sample area.

ScanSpeed
type: Class
type: NamedIndividual
broader: Recipe
definition: The speed range in which the probe moves across a sample

Sensitivity
type: Class
subclass of: Recipe
definition: Equipment sensitivity
definition: The detector's ability to accurately measure and respond to small amounts of infrared radiation.

Sensor
type: Class
subclass of: Tool

SensorPosition
type: Class
subclass of: ValueObject
type: NamedIndividual
broader: Recipe
definition: Coaxial vs concentric

SensorType
type: Class
subclass of: ValueObject
type: NamedIndividual
broader: Tool
definition: Wavelength range

SequenceNumber
type: Class
subclass of: SequenceNumber
type: NamedIndividual
broader: Result

SerialNumber
type: Class
type: NamedIndividual
broader: Tool
definition: A unique identifier assigned to each individual instrument.
definition: Serial numer of the instrument

SeriesResistance
type: Class
subclass of: Result
definition: The series resistance measured by a current voltage process

SetPoint
type: Class
type: NamedIndividual
broader: Recipe
definition: Cleaning process of the substrate.

ShortCircuitCurrent
type: Class
subclass of: Result
definition: The short circuit current measured by a current voltage process

ShuntResistance
type: Class
subclass of: Result
definition: The shunt resistance measured by a current voltage process

SimulatorCurrentRange
type: Class
subclass of: Recipe
definition: The working range of the current of a simulator

SimulatorIntensityRange
type: Class
subclass of: Recipe
definition: The working range of the intensity of a simulator

SimulatorMeasurementType
type: Class
subclass of: Tool
definition: Type of measurement a simulator is performing

SimulatorSpatialUniformity
type: Class
subclass of: Tool
definition: The spational uniformity of a simulator

SimulatorToolModel
type: Class
subclass of: Model
definition: The model of the solar simulator, i.e. FMT-350

SimulatorToolSerialNo
type: Class
subclass of: ToolSerialNo
definition: The serial number of a solar simulator

SimulatorVoltageRange
type: Class
subclass of: Recipe
definition: The working range of the voltage of a simulator

Size
type: Class
type: NamedIndividual
broader: Recipe

Software
type: Class
subclass of: Tool
type: NamedIndividual
broader: Tool
definition: Software used by the instrument to perform AFM technique
definition: Software used in the instrument
definition: the computer programs used to control the instrument.

SolarSimulator
type: Class
subclass of: Tool
definition: A tool used to simulate the environment of a sun for a PV module, to perform a current voltage measurement

SolarSimulatorID
type: Class
subclass of: ToolID
definition: The identification number of a solar simulator

SolarSimulatorManufacturer
type: Class
subclass of: ToolManufacturer
definition: The manufacturer of a solar simulator, i.e. 'Sinton Instruments'

SolarSimulatorName
type: Class
subclass of: ToolName
definition: The name of a solar simulator, i.e. 'Lab 1 Simulator'

Solvent
type: Class
type: NamedIndividual
broader: Recipe

SolventType
type: Class
type: NamedIndividual
broader: Recipe

SpectralRange
type: Class
subclass of: Recipe
definition: Spectral Range
definition: The range of infrared wavelengths the instrument measured

SpincoaterInstrument
type: Class
type: NamedIndividual
broader: Tool

SpincoatingParameters
type: Class
type: NamedIndividual
broader: Recipe

SpotSize
type: Class
subclass of: ValueObject
type: NamedIndividual
broader: Recipe

StackNumber
type: Class
subclass of: ProjectIdentifier
type: NamedIndividual
value: XMLSchemainteger
definition: The stack of the data.

Station
type: Class
subclass of: Department
type: NamedIndividual
value: XMLSchemastring
definition: Particular beamline within the facility.

StepTime
type: Class
subclass of: Recipe
definition: The cummulative time a batch or sample was in exposure.

Beach Mark
type: Class
subclass of: FractographyImageCharacteristic
label: Striation
definition: A mark caused by a changing stress state

Substrate
type: Class
type: NamedIndividual
broader: Recipe

SubstrateDimensions
type: Class
type: NamedIndividual
broader: Recipe

SubstrateMaterial
type: Class
subclass of: ValueObject
type: NamedIndividual
broader: Recipe
definition: Value describing the material that the substrate on which the interdigitated combs lie on is composed of

SubstrateType
type: Class
type: NamedIndividual
broader: Recipe

SunIntensity
type: Class
subclass of: Tool
definition: The established intensity of a current voltage process

SyncXrayDetector
type: Class
subclass of: MeasuringDevice
type: NamedIndividual
has identifier: DetectorName
definition: The detector used to capture the transmitted X-rays.

TearBand
type: Class
subclass of: FractographyImageCharacteristic
definition: A mark perpendicular to the direction of faitgue crack growth

Temperature
type: Class
subclass of: Temperature
type: NamedIndividual
broader: Recipe

temperature-coefficient-current
type: Class
subclass of: Sample
definition: Reduction of some percent of ISC per degree Celsius. Rate at which current changes in reponse to a change in temperature.

temperature-coefficient-power
type: Class
subclass of: Sample
definition: Reduction of some percent of PMP per degree Celsius. Rate at which power changes in reponse to a change in temperature.

temperature-coefficient-voltage
type: Class
subclass of: Sample
definition: Reduction of some percent of VOC per degree Celsius. Rate at which a voltage changes in reponse to a change in temperature.

Thickness
type: Class
subclass of: Result
subclass of: Sample
definition: Thickness of the module, not counting the framing
definition: Thickness of the sample

TiltRange
type: Class
subclass of: Recipe
definition: Range of tilt motion

TipMaterial
type: Class
type: NamedIndividual
broader: Tool
definition: The material of the AFM tip

TipRadius
type: Class
subclass of: Tool
definition: The radius of the AFM tip

Title
type: Class
subclass of: ProjectIdentifier

Tool
type: Class
subclass of: ProcessingNode
type: NamedIndividual

ToolCalibrationDate
type: Class
subclass of: Date
type: NamedIndividual
broader: Tool
value: XMLSchemadateTime
definition: Date that a tool is calibrated

ToolCalibrationPerson
type: Class
subclass of: Person
type: NamedIndividual
broader: Tool
value: XMLSchemastring
definition: Person that calibrated a tool

ToolCalibrationResults
type: Class
subclass of: Result
type: NamedIndividual
broader: Tool
value: XMLSchemastring
definition: Results of a calibration of a tool

ToolID
type: Class
subclass of: Identifier
type: NamedIndividual
broader: Tool
value: XMLSchemastring
definition: Unique ID of a tool

ToolManufacturer
type: Class
subclass of: Manufacturer
type: NamedIndividual
broader: Tool
value: XMLSchemastring
definition: Manufacturer of a tool

Model
type: Class
subclass of: NodeSerialNumber
type: NamedIndividual
broader: Tool
value: XMLSchemastring
label: ToolModel
definition: Model of a tool
definition: The specific version or type of instrument.

ToolSerialNo
type: Class
subclass of: NodeSerialNumber
type: NamedIndividual
broader: Tool
value: XMLSchemastring
definition: Unique serial number of a tool (assigned by manufacturer)

ToolSoftware
type: Class
subclass of: ProcessingNode
type: NamedIndividual
broader: Tool
value: XMLSchemastring
definition: Software used by a tool

TraceMaterial
type: Class
subclass of: ValueObject
type: NamedIndividual
broader: Recipe
definition: Value describing the material that the finger traces are composed of

TrackingAlgorithm
type: Class
subclass of: Model
label: TrackingAlgorithm
definition: If system is tracking, method used (truetracking, backtracking, diffuse tracking, etc)

Transmittance
type: Class
subclass of: Result
definition: transmittance read by instrument

Turn
type: Class
subclass of: ValueObject
type: NamedIndividual
broader: Recipe

VideoID
type: Class
subclass of: ResultID

VoltageAtMaxPower
type: Class
subclass of: Result
definition: The voltage at max power measured by a current voltage process

VoltageAtMaximumPower
type: Class
subclass of: PhotovoltaicCellProperty
subclass of: Sample
label: VoltageAtMaximumPower
definition: DC voltage at the maximum power point of the cell
definition: DC voltage at the maximum power point under STC

VoltageOpenCircuit
type: Class
subclass of: PhotovoltaicCellProperty
subclass of: Sample
label: VoltageOpenCircuit
definition: Module open circuit voltage, maximum voltage the module can provide
definition: Open-circuit voltage of the cell

VoltageTemperatureCoefficient
type: Class
subclass of: Sample
definition: The amount a cell's output voltage changes due to temperature

wafer-crystallinity
type: Class
subclass of: Sample
definition: Distinguishes whether the silicon wafer was manufactured as a single crystal, multiple crystals, or no crystal (amorphous); if not silicon, another value is used such as THIN FILM.

wafer-doping-polarity
type: Class
subclass of: Sample
definition: Doping polarity of absorber. E.g., n-type or p-type.

WaferDopingType
type: Class
subclass of: Sample
definition: Doping type of the wafer that a current voltage process is being performed on

Wavelength
type: Class
subclass of: Length
subclass of: Recipe
type: NamedIndividual
unit: ANGSTROM
value: XMLSchemafloat
definition: The wavelength used for the experiment.
definition: Wavelength(s) of light being used for analysis
definition: wavelength of reading

WavelengthRange
type: Class
subclass of: Recipe
subclass of: ValueObject
type: NamedIndividual
broader: Recipe
definition: The span of infrared wavelengths that the instrument can measure.

Weight
type: Class
subclass of: Sample
definition: Module weight

Width
type: Class
subclass of: Result
subclass of: Sample
subclass of: Width
type: NamedIndividual
broader: Recipe
definition: Width of module along shortest side
definition: Width of the sample

WindDirection
type: Class
subclass of: PhotovoltaicSiteParameter
label: WindDirection

WindSpeed
type: Class
subclass of: PhotovoltaicSiteParameter
label: WindSpeed

XRange
type: Class
subclass of: Recipe
definition: Range in the X direction of probe
definition: Range of motion along the X-axis

YRange
type: Class
subclass of: Recipe
definition: Range in the Y direction of the probe
definition: Range of motion along the Y-axis

ZCoordinate
type: Class
type: NamedIndividual
broader: Result

ZRange
type: Class
subclass of: Recipe
definition: Range in the Z direction of the probe

ZSensor
type: Class
type: NamedIndividual
broader: Tool

ZSensorNoise
type: Class
subclass of: Recipe
definition: Noise level of the Z sensor

ZStop
type: Class
subclass of: Recipe
definition: Point at which the Z-stop is set, minimum Z value.

Algorithm
type: Class

Date
type: Class

Department
type: Class

Distance
type: Class

Force
type: Class

Identifier
type: Class

Laboratory
type: Class

Length
type: Class

Manufacturer
type: Class

MeasuringDevice
type: Class

Metadata
type: Class

Method
type: Class

NodeSerialNumber
type: Class

NonTransformativeAnalysisProcess
type: Class

PrimaryData
type: Class

ProcessingNode
type: Class

ProjectIdentifier
type: Class

Sample
type: Class

SequenceNumber
type: Class

Temperature
type: Class

ValueObject
type: Class

Width
type: Class